Reaction Details
TargetDimer of Protein farnesyltransferase subunit beta
LigandBDBM50088008
Substrate/Competitorn/a
Meas. Tech.ChEMBL_68625 (CHEMBL680675)
Ki 420±n/a nM
Citation Giraud, ELuttmann, CLavelle, FRiou, JFMailliet, PLaoui, A Multivariate data analysis using D-optimal designs, partial least squares, and response surface modeling: A directional approach for the analysis of farnesyltransferase inhibitors. J Med Chem43:1807-16 (2000) Dimer of Protein farnesyltransferase subunit beta
Name:Dimer of Protein farnesyltransferase subunit beta
Synonyms:Protein Farnesyltransferase (PFT) Chain B
Type:n/a
Mol. Mass.:n/a
Description:ASSAY_ID of EBI is 51428
Components:This complex has 3 components.
Component 1
Name:Protein farnesyltransferase subunit beta
Type:Enzyme Subunit
Mol. Mass.:48766.02
Organism:Homo sapiens (Human)
Description:Protein farnesyltransferase subunit beta
Residue:437
Component 2
Name:Protein farnesyltransferase subunit beta
Synonyms:CAAX farnesyltransferase subunit alpha FNTB FTase-alpha GGTase-I-alpha Protein farnesyl/geranylgeranyl transferase Protein farnesyltransferase subunit beta Protein farnesyltransferase/geranylgeranyltransferase type-1 subunit alpha Ras proteins prenyltransferase subunit beta | Type I protein geranyl-geranyltransferase subunit alpha
Type:Enzyme Subunit
Mol. Mass.:48766.02
Organism:Homo sapiens (Human)
Description:Protein farnesyltransferase subunit beta
Residue:437
BDBM50088008
NameBDBM50088008
Synonyms:11-[2-(2-methoxyphenyl)acetyl]-1-phenyl-(1R,8R,9S,13S)-11-azatetracyclo[6.5.2.02,7.09,13]pentadeca-2,4,6-triene-9-methoxycarboxamide (RPR113401) | CHEMBL301809
TypeSmall organic molecule
Emp. Form.C31H32N2O4
Mol. Mass.496.5968
SMILESCONC(=O)[C@]12CN(C[C@H]1[C@]1(CC[C@@H]2c2ccccc12)c1ccccc1)C(=O)Cc1ccccc1OC