Reaction Details
TargetMatrix metalloproteinase-9
LigandBDBM50088066
Substrate/Competitorn/a
Meas. Tech.ChEMBL_105390 (CHEMBL710809)
Ki 0.900000±n/a nM
Citation Scozzafava, ASupuran, CT Protease inhibitors: synthesis of potent bacterial collagenase and matrix metalloproteinase inhibitors incorporating N-4-nitrobenzylsulfonylglycine hydroxamate moieties. J Med Chem43:1858-65 (2000) Matrix metalloproteinase-9
Name:Matrix metalloproteinase-9
Type:Enzyme
Mol. Mass.:78452.28
Organism:Homo sapiens (Human)
Description:P14780
Residue:707
BDBM50088066
NameBDBM50088066
Synonyms:CHEMBL439931 | N-Hydroxy-2-[(4-nitro-benzyl)-(4-(N-benzenesulfonyl)ureido-benzenesulfonyl)-amino]-acetamide
TypeSmall organic molecule
Emp. Form.C22H21N5O9S2
Mol. Mass.563.56
SMILESONC(=O)CN(Cc1ccc(cc1)[N+]([O-])=O)S(=O)(=O)c1ccc(NC(=O)NS(=O)(=O)c2ccccc2)cc1