Reaction Details
TargetMatrix metalloproteinase-9
LigandBDBM50088109
Substrate/Competitorn/a
Meas. Tech.ChEMBL_105390 (CHEMBL710809)
Ki 0.700000±n/a nM
Citation Scozzafava, ASupuran, CT Protease inhibitors: synthesis of potent bacterial collagenase and matrix metalloproteinase inhibitors incorporating N-4-nitrobenzylsulfonylglycine hydroxamate moieties. J Med Chem43:1858-65 (2000) Matrix metalloproteinase-9
Name:Matrix metalloproteinase-9
Type:Enzyme
Mol. Mass.:78452.28
Organism:Homo sapiens (Human)
Description:P14780
Residue:707
BDBM50088109
NameBDBM50088109
Synonyms:CHEMBL55521 | N-Hydroxy-2-[(4-nitro-benzyl)-(4-(N-(2-methyl-benzene)-sulfonyl)ureido-benzenesulfonyl)-amino]-acetamide
TypeSmall organic molecule
Emp. Form.C23H23N5O9S2
Mol. Mass.577.587
SMILESCc1ccccc1S(=O)(=O)NC(=O)Nc1ccc(cc1)S(=O)(=O)N(CC(=O)NO)Cc1ccc(cc1)[N+]([O-])=O