Reaction Details
TargetThymidylate synthase
LigandBDBM50088164
Substrate/Competitorn/a
Meas. Tech.ChEMBL_209994 (CHEMBL811641)
Ki 6000±n/a nM
Citation Bavetsias, VMarriott, JHMelin, CKimbell, RMatusiak, ZSBoyle, FTJackman, AL Design and synthesis of Cyclopenta[g]quinazoline-based antifolates as inhibitors of thymidylate synthase and potential antitumor agents(,). J Med Chem43:1910-26 (2000) Thymidylate synthase
Name:Thymidylate synthase
Type:Enzyme
Mol. Mass.:36576.54
Organism:Lactobacillus casei
Description:n/a
Residue:316
BDBM50088164
NameBDBM50088164
Synonyms:(S)-2-{4-[(2-Methyl-4-oxo-4,6,7,8-tetrahydro-3H-cyclopenta[g]quinazolin-6-yl)-prop-2-ynyl-amino]-benzoylamino}-5-(1H-[1,2,4]triazole-3-sulfonyl)-pentanoic acid CHEMBL55437
TypeSmall organic molecule
Emp. Form.C29H29N7O6S
Mol. Mass.603.649
SMILESCc1nc2cc3CCC(N(CC#C)c4ccc(cc4)C(=O)N[C@@H](CCCS(=O)(=O)c4nnc[nH]4)C(O)=O)c3cc2c(=O)[nH]1