Reaction Details
TargetGlutamate receptor ionotropic, kainate 1
LigandBDBM50088197
Substrate/Competitorn/a
Meas. Tech.ChEMBL_90440 (CHEMBL698072)
Ki 8±n/a nM
Citation Pedregal, CCollado, IEscribano, AEzquerra, JDomínguez, CMateo, AIRubio, ABaker, SRGoldsworthy, JKamboj, RKBallyk, BAHoo, KBleakman, D 4-Alkyl- and 4-cinnamylglutamic acid analogues are potent GluR5 kainate receptor agonists. J Med Chem43:1958-68 (2000) Glutamate receptor ionotropic, kainate 1
Name:Glutamate receptor ionotropic, kainate 1
Type:Enzyme Catalytic Domain
Mol. Mass.:103984.96
Organism:Homo sapiens (Human)
Description:P39086
Residue:918
BDBM50088197
NameBDBM50088197
Synonyms:CHEMBL58590 LY-339295
TypeSmall organic molecule
Emp. Form.C14H16ClNO4
Mol. Mass.297.734
SMILESN[C@@H](C[C@@H](C\C=C\c1ccc(Cl)cc1)C(O)=O)C(O)=O