Reaction Details
TargetGlutamate receptor ionotropic, kainate 2
LigandBDBM50088206
Substrate/Competitorn/a
Meas. Tech.ChEMBL_90582 (CHEMBL701166)
Ki 823.0±n/a nM
Citation Pedregal, CCollado, IEscribano, AEzquerra, JDomínguez, CMateo, AIRubio, ABaker, SRGoldsworthy, JKamboj, RKBallyk, BAHoo, KBleakman, D 4-Alkyl- and 4-cinnamylglutamic acid analogues are potent GluR5 kainate receptor agonists. J Med Chem43:1958-68 (2000) Glutamate receptor ionotropic, kainate 2
Name:Glutamate receptor ionotropic, kainate 2
Type:Enzyme Catalytic Domain
Mol. Mass.:102592.78
Organism:Homo sapiens (Human)
Description:Q13002
Residue:908
BDBM50088206
NameBDBM50088206
Synonyms:2-Amino-4-prop-2-ynyl-pentanedioic acid | CHEMBL58718
TypeSmall organic molecule
Emp. Form.C8H11NO4
Mol. Mass.185.1772
SMILESN[C@@H](C[C@H](CC#C)C(O)=O)C(O)=O