Reaction Details
TargetGlutamate receptor ionotropic, kainate 2
LigandBDBM50088227
Substrate/Competitorn/a
Meas. Tech.ChEMBL_90582 (CHEMBL701166)
Ki 1132±n/a nM
Citation Pedregal, CCollado, IEscribano, AEzquerra, JDomínguez, CMateo, AIRubio, ABaker, SRGoldsworthy, JKamboj, RKBallyk, BAHoo, KBleakman, D 4-Alkyl- and 4-cinnamylglutamic acid analogues are potent GluR5 kainate receptor agonists. J Med Chem43:1958-68 (2000) Glutamate receptor ionotropic, kainate 2
Name:Glutamate receptor ionotropic, kainate 2
Type:Enzyme Catalytic Domain
Mol. Mass.:102592.78
Organism:Homo sapiens (Human)
Description:Q13002
Residue:908
BDBM50088227
NameBDBM50088227
Synonyms:CHEMBL58054 | E-2-Amino-4-[3-(3-chloro-phenyl)-allyl]-pentanedioic acid
TypeSmall organic molecule
Emp. Form.C14H16ClNO4
Mol. Mass.297.734
SMILESN[C@@H](C[C@@H](C\C=C\c1cccc(Cl)c1)C(O)=O)C(O)=O