Reaction Details
TargetGlutamate receptor ionotropic, kainate 2
LigandBDBM50088237
Substrate/Competitorn/a
Meas. Tech.ChEMBL_90582 (CHEMBL701166)
Ki 1000±n/a nM
Citation Pedregal, CCollado, IEscribano, AEzquerra, JDomínguez, CMateo, AIRubio, ABaker, SRGoldsworthy, JKamboj, RKBallyk, BAHoo, KBleakman, D 4-Alkyl- and 4-cinnamylglutamic acid analogues are potent GluR5 kainate receptor agonists. J Med Chem43:1958-68 (2000) Glutamate receptor ionotropic, kainate 2
Name:Glutamate receptor ionotropic, kainate 2
Type:Enzyme Catalytic Domain
Mol. Mass.:102592.78
Organism:Homo sapiens (Human)
Description:Q13002
Residue:908
BDBM50088237
NameBDBM50088237
Synonyms:2-Amino-4-(3-phenyl-prop-2-ynyl)-pentanedioic acid | CHEMBL59792
TypeSmall organic molecule
Emp. Form.C14H15NO4
Mol. Mass.261.2732
SMILESN[C@@H](C[C@@H](CC#Cc1ccccc1)C(O)=O)C(O)=O