Reaction Details
TargetGlutamate receptor ionotropic, kainate 1
LigandBDBM50088235
Substrate/Competitorn/a
Meas. Tech.ChEMBL_90440 (CHEMBL698072)
Ki 32±n/a nM
Citation Pedregal, CCollado, IEscribano, AEzquerra, JDomínguez, CMateo, AIRubio, ABaker, SRGoldsworthy, JKamboj, RKBallyk, BAHoo, KBleakman, D 4-Alkyl- and 4-cinnamylglutamic acid analogues are potent GluR5 kainate receptor agonists. J Med Chem43:1958-68 (2000) Glutamate receptor ionotropic, kainate 1
Name:Glutamate receptor ionotropic, kainate 1
Type:Enzyme Catalytic Domain
Mol. Mass.:103984.96
Organism:Homo sapiens (Human)
Description:P39086
Residue:918
BDBM50088235
NameBDBM50088235
Synonyms:CHEMBL300368 | E-2-Amino-4-[3-(4-methylsulfanyl-phenyl)-allyl]-pentanedioic acid
TypeSmall organic molecule
Emp. Form.C15H19NO4S
Mol. Mass.309.381
SMILESCSc1ccc(\C=C\C[C@H](C[C@H](N)C(O)=O)C(O)=O)cc1