Reaction Details
TargetGag-Pol polyprotein [489-587]
LigandBDBM50088250
Substrate/Competitorn/a
Meas. Tech.ChEMBL_90555 (CHEMBL699597)
IC50 2800±n/a nM
Citation Molteni, VRhodes, DRubins, KHansen, MBushman, FDSiegel, JS A new class of HIV-1 integrase inhibitors: the 3,3,3', 3'-tetramethyl-1,1'-spirobi(indan)-5,5',6,6'-tetrol family. J Med Chem43:2031-9 (2000) Gag-Pol polyprotein [489-587]
Name:Gag-Pol polyprotein [489-587]
Type:Enzyme Subunit
Mol. Mass.:10781.16
Organism:Human immunodeficiency virus type 1
Description:P04585[489-587]
Residue:99
BDBM50088250
NameBDBM50088250
Synonyms:3,3,3',3'-tetramethyl-1,1'-spirobi(indan)-5,5',6,6'-tetrol tetrasulfate | CHEMBL292736
TypeSmall organic molecule
Emp. Form.C21H20O16S4
Mol. Mass.656.636
SMILESCC1(C)CC2(CC(C)(C)c3cc(OS([O-])(=O)=O)c(OS([O-])(=O)=O)cc23)c2cc(OS([O-])(=O)=O)c(OS([O-])(=O)=O)cc12