Reaction Details
TargetC-C chemokine receptor type 3
LigandBDBM50088301
Substrate/Competitorn/a
Meas. Tech.ChEMBL_39480 (CHEMBL650590)
IC50>10000±n/a nM
Citation Shiraishi, MAramaki, YSeto, MImoto, HNishikawa, YKanzaki, NOkamoto, MSawada, HNishimura, OBaba, MFujino, M Discovery of novel, potent, and selective small-molecule CCR5 antagonists as anti-HIV-1 agents: synthesis and biological evaluation of anilide derivatives with a quaternary ammonium moiety. J Med Chem43:2049-63 (2000) C-C chemokine receptor type 3
Name:C-C chemokine receptor type 3
Type:Enzyme
Mol. Mass.:41053.88
Organism:Homo sapiens (Human)
Description:P51677
Residue:355
BDBM50088301
NameBDBM50088301
Synonyms:(E)-N,N-dimethyl-N-(4-(2-p-tolyl-6,7-dihydro-5H-benzo[7]annulene-8-carboxamido)benzyl)tetrahydro-2H-pyran-4-aminium chloride CHEMBL41275 Dimethyl-(tetrahydro-pyran-4-yl)-{4-[(3-p-tolyl-8,9-dihydro-7H-benzocycloheptene-6-carbonyl)-amino]-benzyl}-ammonium; chloride N-(4-(2-p-tolyl-6,7-dihydro-5H-benzo[7]annulene-8-carboxamido)benzyl)-N,N-dimethyl-tetrahydro-2H-pyran-4-aminium chloride | TAK-779
TypeSmall organic molecule
Emp. Form.C33H39N2O2
Mol. Mass.495.6744
SMILESCc1ccc(cc1)-c1ccc2CCCC(=Cc2c1)C(=O)Nc1ccc(C[N+](C)(C)C2CCOCC2)cc1