Reaction Details
TargetC-C chemokine receptor type 5
LigandBDBM50088306
Substrate/Competitorn/a
Meas. Tech.ChEMBL_39630 (CHEMBL649937)
IC50 3.3±n/a nM
Citation Shiraishi, MAramaki, YSeto, MImoto, HNishikawa, YKanzaki, NOkamoto, MSawada, HNishimura, OBaba, MFujino, M Discovery of novel, potent, and selective small-molecule CCR5 antagonists as anti-HIV-1 agents: synthesis and biological evaluation of anilide derivatives with a quaternary ammonium moiety. J Med Chem43:2049-63 (2000) C-C chemokine receptor type 5
Name:C-C chemokine receptor type 5
Type:Enzyme
Mol. Mass.:40540.21
Organism:Homo sapiens (Human)
Description:P51681
Residue:352
BDBM50088306
NameBDBM50088306
Synonyms:(1-Ethyl-propyl)-dimethyl-{4-[(7-p-tolyl-2,3-dihydro-benzo[b]oxepine-4-carbonyl)-amino]-benzyl}-ammonium; iodide | CHEMBL294788
TypeSmall organic molecule
Emp. Form.C32H39N2O2
Mol. Mass.483.6637
SMILESCCC(CC)[N+](C)(C)Cc1ccc(NC(=O)C2=Cc3cc(ccc3OCC2)-c2ccc(C)cc2)cc1