Reaction Details
TargetC-C chemokine receptor type 5
LigandBDBM50088310
Substrate/Competitorn/a
Meas. Tech.ChEMBL_39630 (CHEMBL649937)
IC50 1200±n/a nM
Citation Shiraishi, MAramaki, YSeto, MImoto, HNishikawa, YKanzaki, NOkamoto, MSawada, HNishimura, OBaba, MFujino, M Discovery of novel, potent, and selective small-molecule CCR5 antagonists as anti-HIV-1 agents: synthesis and biological evaluation of anilide derivatives with a quaternary ammonium moiety. J Med Chem43:2049-63 (2000) C-C chemokine receptor type 5
Name:C-C chemokine receptor type 5
Type:Enzyme
Mol. Mass.:40540.21
Organism:Homo sapiens (Human)
Description:P51681
Residue:352
BDBM50088310
NameBDBM50088310
Synonyms:4-Methyl-4-{4-[(7-phenyl-3,4-dihydro-naphthalene-2-carbonyl)-amino]-benzyl}-morpholin-4-ium; iodide | CHEMBL65649
TypeSmall organic molecule
Emp. Form.C29H31N2O2
Mol. Mass.439.5681
SMILESC[N+]1(Cc2ccc(NC(=O)C3=Cc4cc(ccc4CC3)-c3ccccc3)cc2)CCOCC1