Reaction Details
TargetC-C chemokine receptor type 5
LigandBDBM50088322
Substrate/Competitorn/a
Meas. Tech.ChEMBL_39630 (CHEMBL649937)
IC50 1.8±n/a nM
Citation Shiraishi, MAramaki, YSeto, MImoto, HNishikawa, YKanzaki, NOkamoto, MSawada, HNishimura, OBaba, MFujino, M Discovery of novel, potent, and selective small-molecule CCR5 antagonists as anti-HIV-1 agents: synthesis and biological evaluation of anilide derivatives with a quaternary ammonium moiety. J Med Chem43:2049-63 (2000) C-C chemokine receptor type 5
Name:C-C chemokine receptor type 5
Type:Enzyme
Mol. Mass.:40540.21
Organism:Homo sapiens (Human)
Description:P51681
Residue:352
BDBM50088322
NameBDBM50088322
Synonyms:(4-{[7-(4-Ethoxy-phenyl)-2,3-dihydro-benzo[b]oxepine-4-carbonyl]-amino}-benzyl)-dimethyl-(tetrahydro-pyran-4-yl)-ammonium; iodide | CHEMBL293393
TypeSmall organic molecule
Emp. Form.C33H39N2O4
Mol. Mass.527.6732
SMILESCCOc1ccc(cc1)-c1ccc2OCCC(=Cc2c1)C(=O)Nc1ccc(C[N+](C)(C)C2CCOCC2)cc1