Reaction Details
TargetDelta-type opioid receptor
LigandBDBM50088361
Substrate/Competitorn/a
Meas. Tech.ChEMBL_147040 (CHEMBL753343)
Ki 7500±n/a nM
Citation Vianello, PAlbinati, APinna, GALavecchia, AMarinelli, LBorea, PAGessi, SFadda, PTronci, SCignarella, G Synthesis, molecular modeling, and opioid receptor affinity of 9, 10-diazatricyclo[4.2.1.1(2,5)]decanes and 2,7-diazatricyclo[4.4.0. 0(3,8)]decanes structurally related to 3,8-diazabicyclo[3.2. 1]octanes. J Med Chem43:2115-23 (2000) Delta-type opioid receptor
Name:Delta-type opioid receptor
Type:G Protein-Coupled Receptor (GPCR)
Mol. Mass.:40465.04
Organism:Rattus norvegicus (rat)
Description:Competition binding assays were using CHO-K1 cell membranes expressing the opioid receptor.
Residue:372
BDBM50088361
NameBDBM50088361
Synonyms:1-{10-[3-(3-Nitro-phenyl)-allyl]-9,10-diaza-tricyclo[4.2.1.1*2,5*]dec-9-yl}-propan-1-one | CHEMBL67384
TypeSmall organic molecule
Emp. Form.C20H25N3O3
Mol. Mass.355.4308
SMILESCCC(=O)N1C2CC[C@H]1[C@@H]1CCC2N1C\C=C\c1cccc(c1)[N+]([O-])=O