Reaction Details
TargetMu-type opioid receptor
LigandBDBM50088371
Substrate/Competitorn/a
Meas. Tech.ChEMBL_148997 (CHEMBL757981)
Ki 160±n/a nM
Citation Vianello, PAlbinati, APinna, GALavecchia, AMarinelli, LBorea, PAGessi, SFadda, PTronci, SCignarella, G Synthesis, molecular modeling, and opioid receptor affinity of 9, 10-diazatricyclo[4.2.1.1(2,5)]decanes and 2,7-diazatricyclo[4.4.0. 0(3,8)]decanes structurally related to 3,8-diazabicyclo[3.2. 1]octanes. J Med Chem43:2115-23 (2000) Mu-type opioid receptor
Name:Mu-type opioid receptor
Type:G Protein-Coupled Receptor (GPCR)
Mol. Mass.:44503.11
Organism:Rattus norvegicus (rat)
Description:Competition binding assays were carried out using membrane preparations from transfected HN9.10 cells that constitutively expressed the mu opioid receptor.
Residue:398
BDBM50088371
NameBDBM50088371
Synonyms:1-[8-(3-Phenyl-allyl)-3,8-diaza-bicyclo[3.2.1]oct-3-yl]-propan-1-one | CHEMBL306002
TypeSmall organic molecule
Emp. Form.C18H24N2O
Mol. Mass.284.396
SMILESCCC(=O)N1CC2CCC(C1)N2C\C=C\c1ccccc1