Reaction Details
TargetAlpha-1B adrenergic receptor
LigandBDBM50060964
Substrate/Competitorn/a
Meas. Tech.ChEMBL_34335 (CHEMBL648995)
Ki 1.92±n/a nM
Citation Kuo, GHProuty, CMurray, WVPulito, VJolliffe, LCheung, PVarga, SEvangelisto, MWang, J Design, synthesis, and structure-activity relationships of phthalimide-phenylpiperazines: a novel series of potent and selective alpha(1)(a)-adrenergic receptor antagonists. J Med Chem43:2183-95 (2000) Alpha-1B adrenergic receptor
Name:Alpha-1B adrenergic receptor
Type:Enzyme
Mol. Mass.:56862.13
Organism:Homo sapiens (Human)
Description:P35368
Residue:520
BDBM50060964
NameBDBM50060964
Synonyms:(R)-5-(2-((2-(2-ethoxyphenoxy)ethyl)amino)propyl)-2-methoxybenzenesulfonamide 5-[2-[2-(2-ethoxyphenoxy)ethylamino]propyl]-2-methoxy-benzenesulfonamide TAMSULOSIN
TypeSmall organic molecule
Emp. Form.C20H28N2O5S
Mol. Mass.408.512
SMILESCCOc1ccccc1OCCN[C@H](C)Cc1ccc(OC)c(c1)S(N)(=O)=O