Reaction Details
TargetAlpha-1A adrenergic receptor
LigandBDBM50088399
Substrate/Competitorn/a
Meas. Tech.ChEMBL_33612 (CHEMBL652819)
Ki 6.9±n/a nM
Citation Kuo, GHProuty, CMurray, WVPulito, VJolliffe, LCheung, PVarga, SEvangelisto, MWang, J Design, synthesis, and structure-activity relationships of phthalimide-phenylpiperazines: a novel series of potent and selective alpha(1)(a)-adrenergic receptor antagonists. J Med Chem43:2183-95 (2000) Alpha-1A adrenergic receptor
Name:Alpha-1A adrenergic receptor
Type:Cell-surface receptors
Mol. Mass.:51511.67
Organism:Homo sapiens (Human)
Description:P35348
Residue:466
BDBM50088399
NameBDBM50088399
Synonyms:2-(3-Fluoro-phenyl)-1,3-dioxo-2,3-dihydro-1H-isoindole-5-carboxylic acid {3-[4-(2-isopropoxy-phenyl)-piperazin-1-yl]-2-methoxy-propyl}-amide | CHEMBL69245
TypeSmall organic molecule
Emp. Form.C32H35FN4O5
Mol. Mass.574.6425
SMILESCOC(CNC(=O)c1ccc2C(=O)N(C(=O)c2c1)c1cccc(F)c1)CN1CCN(CC1)c1ccccc1OC(C)C