Reaction Details
TargetD(2) dopamine receptor
LigandBDBM50088394
Substrate/Competitorn/a
Meas. Tech.ChEMBL_61615 (CHEMBL672912)
Ki 23±n/a nM
Citation Kuo, GHProuty, CMurray, WVPulito, VJolliffe, LCheung, PVarga, SEvangelisto, MWang, J Design, synthesis, and structure-activity relationships of phthalimide-phenylpiperazines: a novel series of potent and selective alpha(1)(a)-adrenergic receptor antagonists. J Med Chem43:2183-95 (2000) D(2) dopamine receptor
Name:D(2) dopamine receptor
Type:Cell-surface receptors
Mol. Mass.:50647.10
Organism:Homo sapiens (Human)
Description:P14416
Residue:443
BDBM50088394
NameBDBM50088394
Synonyms:2-(4-Dimethylamino-phenyl)-1,3-dioxo-2,3-dihydro-1H-isoindole-5-carboxylic acid {2-hydroxy-3-[4-(2-isopropoxy-phenyl)-piperazin-1-yl]-propyl}-amide | CHEMBL309106
TypeSmall organic molecule
Emp. Form.C33H39N5O5
Mol. Mass.585.6933
SMILESCC(C)Oc1ccccc1N1CCN(C[C@@H](O)CNC(=O)c2ccc3C(=O)N(C(=O)c3c2)c2ccc(cc2)N(C)C)CC1