Reaction Details
TargetAlpha-1A adrenergic receptor
LigandBDBM50088413
Substrate/Competitorn/a
Meas. Tech.ChEMBL_33612 (CHEMBL652819)
Ki 8±n/a nM
Citation Kuo, GHProuty, CMurray, WVPulito, VJolliffe, LCheung, PVarga, SEvangelisto, MWang, J Design, synthesis, and structure-activity relationships of phthalimide-phenylpiperazines: a novel series of potent and selective alpha(1)(a)-adrenergic receptor antagonists. J Med Chem43:2183-95 (2000) Alpha-1A adrenergic receptor
Name:Alpha-1A adrenergic receptor
Type:Cell-surface receptors
Mol. Mass.:51511.67
Organism:Homo sapiens (Human)
Description:P35348
Residue:466
BDBM50088413
NameBDBM50088413
Synonyms:2-(3-Fluoro-phenyl)-1,3-dioxo-2,3-dihydro-1H-isoindole-5-carboxylic acid {2-hydroxy-3-[4-(2-isopropoxy-phenyl)-piperazin-1-yl]-propyl}-amide | CHEMBL71473
TypeSmall organic molecule
Emp. Form.C31H33FN4O5
Mol. Mass.560.6159
SMILESCC(C)Oc1ccccc1N1CCN(C[C@H](O)CNC(=O)c2ccc3C(=O)N(C(=O)c3c2)c2cccc(F)c2)CC1