Reaction Details
TargetAdenosine receptor A3
LigandBDBM50067081
Substrate/Competitorn/a
Meas. Tech.ChEMBL_31844 (CHEMBL641521)
Ki 143±n/a nM
Citation van Muijlwijk-Koezen, JETimmerman, Hvan der Goot, HMenge, WMFrijtag Von Drabbe Künzel, Jde Groote, MIJzerman, AP Isoquinoline and quinazoline urea analogues as antagonists for the human adenosine A(3) receptor. J Med Chem43:2227-38 (2000) Adenosine receptor A3
Name:Adenosine receptor A3
Type:G Protein-Coupled Receptor (GPCR)
Mol. Mass.:36197.32
Organism:Homo sapiens (Human)
Description:P0DMS8
Residue:318
BDBM50067081
NameBDBM50067081
Synonyms:9-Fluoro-2-furan-2-yl-5,6-dihydro-[1,2,4]triazolo[1,5-c]quinazolin-5-ylamine CGS-15943 | CHEMBL70605
TypeSmall organic molecule
Emp. Form.C13H8FN5O
Mol. Mass.269.2339
SMILESNc1nc2ccc(F)cc2c2nc(nn12)-c1ccco1