Reaction Details
TargetAdenosine receptor A3
LigandBDBM50088466
Substrate/Competitorn/a
Meas. Tech.ChEMBL_31844 (CHEMBL641521)
Ki 172±n/a nM
Citation van Muijlwijk-Koezen, JETimmerman, Hvan der Goot, HMenge, WMFrijtag Von Drabbe Künzel, Jde Groote, MIJzerman, AP Isoquinoline and quinazoline urea analogues as antagonists for the human adenosine A(3) receptor. J Med Chem43:2227-38 (2000) Adenosine receptor A3
Name:Adenosine receptor A3
Type:G Protein-Coupled Receptor (GPCR)
Mol. Mass.:36197.32
Organism:Homo sapiens (Human)
Description:P0DMS8
Residue:318
BDBM50088466
NameBDBM50088466
Synonyms:9-Methyl-2-phenyl-5,9-dihydro-[1,2,4]triazolo[5,1-a]isoquinoline-6-carboxylic acid methyl ester | CHEMBL309755
TypeSmall organic molecule
Emp. Form.C19H17N3O2
Mol. Mass.319.3572
SMILESCOC(=O)C1=C2C=CC(C)C=C2c2nc(nn2C1)-c1ccccc1