Reaction Details
TargetAdenosine receptor A3
LigandBDBM50067089
Substrate/Competitorn/a
Meas. Tech.ChEMBL_31844 (CHEMBL641521)
Ki 730±n/a nM
Citation van Muijlwijk-Koezen, JETimmerman, Hvan der Goot, HMenge, WMFrijtag Von Drabbe Künzel, Jde Groote, MIJzerman, AP Isoquinoline and quinazoline urea analogues as antagonists for the human adenosine A(3) receptor. J Med Chem43:2227-38 (2000) Adenosine receptor A3
Name:Adenosine receptor A3
Type:G Protein-Coupled Receptor (GPCR)
Mol. Mass.:36197.32
Organism:Homo sapiens (Human)
Description:P0DMS8
Residue:318
BDBM50067089
NameBDBM50067089
Synonyms:CHEMBL72897 | N-(3-Pyridin-2-yl-isoquinolin-1-yl)-benzamidine
TypeSmall organic molecule
Emp. Form.C21H16N4
Mol. Mass.324.3785
SMILESNC(=Nc1nc(cc2ccccc12)-c1ccccn1)c1ccccc1