Reaction Details
TargetSerine protease 1
LigandBDBM50088657
Substrate/Competitorn/a
Meas. Tech.ChEMBL_209065 (CHEMBL815657)
Ki 0.240000±n/a nM
Citation Coburn, CARush, DMWilliams, PDHomnick, CLyle, EALewis, SDLucas, BJDi Muzio-Mower, JMJuliano, MKrueger, JAVastag, KChen, IWVacca, JP Bicyclic pyridones as potent, efficacious and orally bioavailable thrombin inhibitors. Bioorg Med Chem Lett10:1069-72 (2000) Serine protease 1
Name:Serine protease 1
Type:Enzyme
Mol. Mass.:26557.80
Organism:Homo sapiens (Human)
Description:P07477
Residue:247
BDBM50088657
NameBDBM50088657
Synonyms:CHEMBL11181 | N-(6-Amino-2-methyl-pyridin-3-ylmethyl)-2-((R)-3-isobutyl-3,6-dimethyl-2,8-dioxo-2,3,4,8-tetrahydro-1H-[1,7]naphthyridin-7-yl)-acetamide
TypeSmall organic molecule
Emp. Form.C23H31N5O3
Mol. Mass.425.5239
SMILESCC(C)C[C@]1(C)Cc2cc(C)n(CC(=O)NCc3ccc(N)nc3C)c(=O)c2NC1=O