Reaction Details
Target5-hydroxytryptamine receptor 1A
LigandBDBM50088695
Substrate/Competitorn/a
Meas. Tech.ChEBML_1153
Ki 2.5±n/a nM
Citation Modica, MSantagati, MSantagati, ARusso, FCagnotto, AGoegan, MMennini, T High potent and selective arylpiperazine derivatives as ligands for the 5-HT1A receptor. Bioorg Med Chem Lett10:1089-92 (2000) 5-hydroxytryptamine receptor 1A
Name:5-hydroxytryptamine receptor 1A
Type:G Protein-Coupled Receptor (GPCR)
Mol. Mass.:46445.29
Organism:Rattus norvegicus (rat)
Description:Binding assays were performed using rat hippocampal membranes.
Residue:422
BDBM50088695
NameBDBM50088695
Synonyms:2-{3-[4-(2-Methoxy-phenyl)-piperazin-1-yl]-propylsulfanyl}-5,6-dimethyl-thieno[2,3-d]pyrimidin-4-ylamine | CHEMBL11936
TypeSmall organic molecule
Emp. Form.C22H29N5OS2
Mol. Mass.443.629
SMILESCOc1ccccc1N1CCN(CCCSc2nc(N)c3c(C)c(C)sc3n2)CC1