Reaction Details
TargetDelta-type opioid receptor
LigandBDBM50088732
Substrate/Competitorn/a
Meas. Tech.ChEBML_147034
Ki 30±n/a nM
Citation Boyd, RECarson, JRCodd, EEGauthier, ADNeilson, LAZhang, SP Synthesis and binding affinities of 4-diarylaminotropanes, a new class of delta opioid agonists. Bioorg Med Chem Lett10:1109-11 (2000) Delta-type opioid receptor
Name:Delta-type opioid receptor
Type:G Protein-Coupled Receptor (GPCR)
Mol. Mass.:40465.04
Organism:Rattus norvegicus (rat)
Description:Competition binding assays were using CHO-K1 cell membranes expressing the opioid receptor.
Residue:372
BDBM50088732
NameBDBM50088732
Synonyms:CHEMBL13309 | N,N-Dimethyl-4-[((1R,3S,5S)-8-phenethyl-8-aza-bicyclo[3.2.1]oct-3-yl)-phenyl-amino]-benzamide
TypeSmall organic molecule
Emp. Form.C30H35N3O
Mol. Mass.453.6184
SMILESCN(C)C(=O)c1ccc(cc1)N([C@H]1C[C@@H]2CC[C@H](C1)N2CCc1ccccc1)c1ccccc1