Reaction Details
TargetDelta-type opioid receptor
LigandBDBM50088729
Substrate/Competitorn/a
Meas. Tech.ChEBML_147034
Ki 4±n/a nM
Citation Boyd, RECarson, JRCodd, EEGauthier, ADNeilson, LAZhang, SP Synthesis and binding affinities of 4-diarylaminotropanes, a new class of delta opioid agonists. Bioorg Med Chem Lett10:1109-11 (2000) Delta-type opioid receptor
Name:Delta-type opioid receptor
Type:G Protein-Coupled Receptor (GPCR)
Mol. Mass.:40465.04
Organism:Rattus norvegicus (rat)
Description:Competition binding assays were using CHO-K1 cell membranes expressing the opioid receptor.
Residue:372
BDBM50088729
NameBDBM50088729
Synonyms:CHEMBL12752 | N,N-Diethyl-4-{phenyl-[(1R,3R,5S)-8-(3-phenyl-propyl)-8-aza-bicyclo[3.2.1]oct-3-yl]-amino}-benzamide
TypeSmall organic molecule
Emp. Form.C33H41N3O
Mol. Mass.495.6981
SMILESCCN(CC)C(=O)c1ccc(cc1)N([C@@H]1C[C@@H]2CC[C@H](C1)N2CCCc1ccccc1)c1ccccc1