Reaction Details
TargetMu-type opioid receptor
LigandBDBM50088716
Substrate/Competitorn/a
Meas. Tech.ChEBML_148989
Ki 13±n/a nM
Citation Boyd, RECarson, JRCodd, EEGauthier, ADNeilson, LAZhang, SP Synthesis and binding affinities of 4-diarylaminotropanes, a new class of delta opioid agonists. Bioorg Med Chem Lett10:1109-11 (2000) Mu-type opioid receptor
Name:Mu-type opioid receptor
Type:G Protein-Coupled Receptor (GPCR)
Mol. Mass.:44503.11
Organism:Rattus norvegicus (rat)
Description:Competition binding assays were carried out using membrane preparations from transfected HN9.10 cells that constitutively expressed the mu opioid receptor.
Residue:398
BDBM50088716
NameBDBM50088716
Synonyms:CHEMBL13169 | N,N-Diethyl-4-[((1R,3R,5S)-8-phenethyl-8-aza-bicyclo[3.2.1]oct-3-yl)-phenyl-amino]-benzamide
TypeSmall organic molecule
Emp. Form.C32H39N3O
Mol. Mass.481.6716
SMILESCCN(CC)C(=O)c1ccc(cc1)N([C@@H]1C[C@@H]2CC[C@H](C1)N2CCc1ccccc1)c1ccccc1