Reaction Details
TargetMu-type opioid receptor
LigandBDBM50088737
Substrate/Competitorn/a
Meas. Tech.ChEBML_148989
Ki 130±n/a nM
Citation Boyd, RECarson, JRCodd, EEGauthier, ADNeilson, LAZhang, SP Synthesis and binding affinities of 4-diarylaminotropanes, a new class of delta opioid agonists. Bioorg Med Chem Lett10:1109-11 (2000) Mu-type opioid receptor
Name:Mu-type opioid receptor
Type:G Protein-Coupled Receptor (GPCR)
Mol. Mass.:44503.11
Organism:Rattus norvegicus (rat)
Description:Competition binding assays were carried out using membrane preparations from transfected HN9.10 cells that constitutively expressed the mu opioid receptor.
Residue:398
BDBM50088737
NameBDBM50088737
Synonyms:CHEMBL275288 | N,N-Diethyl-4-[((1R,3R,5S)-8-hexyl-8-aza-bicyclo[3.2.1]oct-3-yl)-phenyl-amino]-benzamide
TypeSmall organic molecule
Emp. Form.C30H43N3O
Mol. Mass.461.6819
SMILESCCCCCCN1[C@H]2CC[C@@H]1C[C@@H](C2)N(c1ccccc1)c1ccc(cc1)C(=O)N(CC)CC