Reaction Details
TargetAlpha-1A/Alpha-1B/Alpha-1D adrenergic receptor
LigandBDBM50088847
Substrate/Competitorn/a
Meas. Tech.ChEMBL_32562 (CHEMBL645696)
Ki>1000±n/a nM
Citation Hanano, TAdachi, KAoki, YMorimoto, HNaka, YHisadome, MFukuda, TSumichika, H Novel phenylpiperazine derivatives as dual cytokine regulators with TNF-alpha suppressing and IL-10 augmenting activity. Bioorg Med Chem Lett10:875-9 (2000) Alpha-1A/Alpha-1B/Alpha-1D adrenergic receptor
Name:Alpha-1A/Alpha-1B/Alpha-1D adrenergic receptor
Type:n/a
Mol. Mass.:n/a
Description:ASSAY_ID of EBI is 303470
Components:This complex has 3 components.
Component 1
Name:Alpha-1B adrenergic receptor
Synonyms:ADA1B_RAT Alpha 1B-adrenoceptor Alpha adrenergic receptor 1A and 1B Alpha-1Adrenoceptor Alpha-1B adrenoreceptor | adrenergic Alpha1B
Type:G Protein-Coupled Receptor (GPCR)
Mol. Mass.:56606.71
Organism:Rattus norvegicus (rat)
Description:Receptor binding assays were performed using rat cortical membranes.
Residue:515
Component 2
Name:Alpha-1A adrenergic receptor
Synonyms:ADA1A_RAT Adra1c Alpha-1A adrenoceptor Alpha-1C adrenergic receptor | adrenergic Alpha1A
Type:Protein
Mol. Mass.:51620.15
Organism:Rattus norvegicus (Rat)
Description:P43140
Residue:466
Component 3
Name:Alpha-1D adrenergic receptor
Synonyms:ADA1D_RAT Adra1d Alpha-1D adrenergic receptor | Serotonin 1a (5-HT1a) receptor/Adrenergic receptor alpha-1
Type:Protein
Mol. Mass.:59375.97
Organism:Rattus norvegicus (Rat)
Description:P23944
Residue:561
BDBM50088847
NameBDBM50088847
Synonyms:CHEMBL171345 | N-{4-[4-(4-Chloro-phenyl)-piperazin-1-ylmethyl]-benzyl}-acetamide
TypeSmall organic molecule
Emp. Form.C20H24ClN3O
Mol. Mass.357.877
SMILESCC(=O)NCc1ccc(CN2CCN(CC2)c2ccc(Cl)cc2)cc1