Reaction Details
TargetD(2) dopamine receptor
LigandBDBM50088839
Substrate/Competitorn/a
Meas. Tech.ChEBML_59636
Ki 49±n/a nM
Citation Hanano, TAdachi, KAoki, YMorimoto, HNaka, YHisadome, MFukuda, TSumichika, H Novel phenylpiperazine derivatives as dual cytokine regulators with TNF-alpha suppressing and IL-10 augmenting activity. Bioorg Med Chem Lett10:875-9 (2000) D(2) dopamine receptor
Name:D(2) dopamine receptor
Type:Enzyme Catalytic Domain
Mol. Mass.:50698.79
Organism:BOVINE
Description:P20288
Residue:444
BDBM50088839
NameBDBM50088839
Synonyms:CHEMBL169702 | N-{4-[4-(4-Phenyl-piperazin-1-yl)-butyl]-benzyl}-acetamide
TypeSmall organic molecule
Emp. Form.C23H31N3O
Mol. Mass.365.5117
SMILESCC(=O)NCc1ccc(CCCCN2CCN(CC2)c2ccccc2)cc1