Reaction Details
TargetD(2) dopamine receptor
LigandBDBM50088842
Substrate/Competitorn/a
Meas. Tech.ChEBML_59636
Ki>1000±n/a nM
Citation Hanano, TAdachi, KAoki, YMorimoto, HNaka, YHisadome, MFukuda, TSumichika, H Novel phenylpiperazine derivatives as dual cytokine regulators with TNF-alpha suppressing and IL-10 augmenting activity. Bioorg Med Chem Lett10:875-9 (2000) D(2) dopamine receptor
Name:D(2) dopamine receptor
Type:Enzyme Catalytic Domain
Mol. Mass.:50698.79
Organism:BOVINE
Description:P20288
Residue:444
BDBM50088842
NameBDBM50088842
Synonyms:CHEMBL171052 | N-{4-[4-(4-Fluoro-phenyl)-piperazin-1-ylmethyl]-benzyl}-acetamide
TypeSmall organic molecule
Emp. Form.C20H24FN3O
Mol. Mass.341.4225
SMILESCC(=O)NCc1ccc(CN2CCN(CC2)c2ccc(F)cc2)cc1