Reaction Details
Target5-hydroxytryptamine receptor 1D
LigandBDBM50088861
Substrate/Competitorn/a
Meas. Tech.ChEBML_1733
Ki 19±n/a nM
Citation Meng, CQRakhit, SLee, DKKamboj, RMcCallum, KLMazzocco, LDyne, KSlassi, A 5-Thienyltryptamine derivatives as serotonin 5-HT1B/1D receptor agonists: potential treatments for migraine. Bioorg Med Chem Lett10:903-5 (2000) 5-hydroxytryptamine receptor 1D
Name:5-hydroxytryptamine receptor 1D
Type:G Protein-Coupled Receptor (GPCR)
Mol. Mass.:41920.63
Organism:Homo sapiens (Human)
Description:Receptor binding assays were performed using human clone stably expressed in CHO cells.
Residue:377
BDBM50088861
NameBDBM50088861
Synonyms:3-(2-Pyrrolidin-1-yl-ethyl)-5-thiophen-2-yl-1H-indole | CHEMBL353256
TypeSmall organic molecule
Emp. Form.C18H20N2S
Mol. Mass.296.43
SMILESC(Cc1c[nH]c2ccc(cc12)-c1cccs1)N1CCCC1