Reaction Details
Target5-hydroxytryptamine receptor 1D
LigandBDBM50088862
Substrate/Competitorn/a
Meas. Tech.ChEBML_1733
Ki 31±n/a nM
Citation Meng, CQRakhit, SLee, DKKamboj, RMcCallum, KLMazzocco, LDyne, KSlassi, A 5-Thienyltryptamine derivatives as serotonin 5-HT1B/1D receptor agonists: potential treatments for migraine. Bioorg Med Chem Lett10:903-5 (2000) 5-hydroxytryptamine receptor 1D
Name:5-hydroxytryptamine receptor 1D
Type:G Protein-Coupled Receptor (GPCR)
Mol. Mass.:41920.63
Organism:Homo sapiens (Human)
Description:Receptor binding assays were performed using human clone stably expressed in CHO cells.
Residue:377
BDBM50088862
NameBDBM50088862
Synonyms:5-(5-Chloro-thiophen-2-yl)-3-(2-pyrrolidin-1-yl-ethyl)-1H-indole | CHEMBL423610
TypeSmall organic molecule
Emp. Form.C18H19ClN2S
Mol. Mass.330.875
SMILESClc1ccc(s1)-c1ccc2[nH]cc(CCN3CCCC3)c2c1