Reaction Details
Target5-hydroxytryptamine receptor 1D
LigandBDBM50088865
Substrate/Competitorn/a
Meas. Tech.ChEBML_1733
Ki 8.2±n/a nM
Citation Meng, CQRakhit, SLee, DKKamboj, RMcCallum, KLMazzocco, LDyne, KSlassi, A 5-Thienyltryptamine derivatives as serotonin 5-HT1B/1D receptor agonists: potential treatments for migraine. Bioorg Med Chem Lett10:903-5 (2000) 5-hydroxytryptamine receptor 1D
Name:5-hydroxytryptamine receptor 1D
Type:G Protein-Coupled Receptor (GPCR)
Mol. Mass.:41920.63
Organism:Homo sapiens (Human)
Description:Receptor binding assays were performed using human clone stably expressed in CHO cells.
Residue:377
BDBM50088865
NameBDBM50088865
Synonyms:CHEMBL174141 | {(S)-1-[2-(5-Thiophen-2-yl-1H-indol-3-yl)-ethyl]-pyrrolidin-2-yl}-methanol
TypeSmall organic molecule
Emp. Form.C19H22N2OS
Mol. Mass.326.456
SMILESOC[C@@H]1CCCN1CCc1c[nH]c2ccc(cc12)-c1cccs1