Reaction Details
Target5-hydroxytryptamine receptor 1D
LigandBDBM50088864
Substrate/Competitorn/a
Meas. Tech.ChEBML_1733
Ki 1.8±n/a nM
Citation Meng, CQRakhit, SLee, DKKamboj, RMcCallum, KLMazzocco, LDyne, KSlassi, A 5-Thienyltryptamine derivatives as serotonin 5-HT1B/1D receptor agonists: potential treatments for migraine. Bioorg Med Chem Lett10:903-5 (2000) 5-hydroxytryptamine receptor 1D
Name:5-hydroxytryptamine receptor 1D
Type:G Protein-Coupled Receptor (GPCR)
Mol. Mass.:41920.63
Organism:Homo sapiens (Human)
Description:Receptor binding assays were performed using human clone stably expressed in CHO cells.
Residue:377
BDBM50088864
NameBDBM50088864
Synonyms:3-[2-((S)-2-Methoxymethyl-pyrrolidin-1-yl)-ethyl]-5-thiophen-2-yl-1H-indole | CHEMBL369798
TypeSmall organic molecule
Emp. Form.C20H24N2OS
Mol. Mass.340.482
SMILESCOC[C@@H]1CCCN1CCc1c[nH]c2ccc(cc12)-c1cccs1