Reaction Details
TargetProto-oncogene tyrosine-protein kinase Src
LigandBDBM50088908
Substrate/Competitorn/a
Meas. Tech.ChEMBL_216859 (CHEMBL816696)
IC50 50±n/a nM
Citation Missbach, MAltmann, EWidler, LSusa, MBuchdunger, EMett, HMeyer, TGreen, J Substituted 5,7-diphenyl-pyrrolo[2,3d]pyrimidines: potent inhibitors of the tyrosine kinase c-Src. Bioorg Med Chem Lett10:945-9 (2000) Proto-oncogene tyrosine-protein kinase Src
Name:Proto-oncogene tyrosine-protein kinase Src
Type:Tyr protein kinase
Mol. Mass.:60015.36
Organism:Gallus gallus (Chicken)
Description:P00523
Residue:533
BDBM50088908
NameBDBM50088908
Synonyms:5-(3-Methoxy-phenyl)-7-phenyl-7H-pyrrolo[2,3-d]pyrimidin-4-ylamine CHEMBL172973
TypeSmall organic molecule
Emp. Form.C19H16N4O
Mol. Mass.316.3565
SMILESCOc1cccc(c1)-c1cn(-c2ccccc2)c2ncnc(N)c12