Reaction Details
TargetCoagulation factor X
LigandBDBM50088951
Substrate/Competitorn/a
Meas. Tech.ChEBML_48831
Ki 0.087000±n/a nM
Citation Zhao, ZArnaiz, DOGriedel, BSakata, SDallas, JLWhitlow, MTrinh, LPost, JLiang, AMorrissey, MMShaw, KJ Design, synthesis, and in vitro biological activity of benzimidazole based factor Xa inhibitors. Bioorg Med Chem Lett10:963-6 (2000) Coagulation factor X
Name:Coagulation factor X
Type:Enzyme
Mol. Mass.:54726.60
Organism:Homo sapiens (Human)
Description:n/a
Residue:488
BDBM50088951
NameBDBM50088951
Synonyms:7-{2-Ethyl-6-[1-(1-imino-ethyl)-piperidin-4-yloxy]-benzoimidazol-1-ylmethyl}-naphthalene-2-carboxamidine | CHEMBL367840
TypeSmall organic molecule
Emp. Form.C28H32N6O
Mol. Mass.468.5933
SMILESCCc1nc2ccc(OC3CCN(CC3)C(C)=N)cc2n1Cc1ccc2ccc(cc2c1)C(N)=N