Reaction Details
TargetCoagulation factor X
LigandBDBM50088963
Substrate/Competitorn/a
Meas. Tech.ChEBML_48831
Ki 0.026000±n/a nM
Citation Zhao, ZArnaiz, DOGriedel, BSakata, SDallas, JLWhitlow, MTrinh, LPost, JLiang, AMorrissey, MMShaw, KJ Design, synthesis, and in vitro biological activity of benzimidazole based factor Xa inhibitors. Bioorg Med Chem Lett10:963-6 (2000) Coagulation factor X
Name:Coagulation factor X
Type:Enzyme
Mol. Mass.:54726.60
Organism:Homo sapiens (Human)
Description:n/a
Residue:488
BDBM50088963
NameBDBM50088963
Synonyms:7-{6-[1-(1-Imino-ethyl)-piperidin-4-yloxy]-2-isopropyl-benzoimidazol-1-ylmethyl}-naphthalene-2-carboxamidine | CHEMBL177142
TypeSmall organic molecule
Emp. Form.C29H34N6O
Mol. Mass.482.6199
SMILESCC(C)c1nc2ccc(OC3CCN(CC3)C(C)=N)cc2n1Cc1ccc2ccc(cc2c1)C(N)=N