Reaction Details
TargetCoagulation factor X
LigandBDBM50088933
Substrate/Competitorn/a
Meas. Tech.ChEBML_48831
Ki 0.300000±n/a nM
Citation Zhao, ZArnaiz, DOGriedel, BSakata, SDallas, JLWhitlow, MTrinh, LPost, JLiang, AMorrissey, MMShaw, KJ Design, synthesis, and in vitro biological activity of benzimidazole based factor Xa inhibitors. Bioorg Med Chem Lett10:963-6 (2000) Coagulation factor X
Name:Coagulation factor X
Type:Enzyme
Mol. Mass.:54726.60
Organism:Homo sapiens (Human)
Description:n/a
Residue:488
BDBM50088933
NameBDBM50088933
Synonyms:CHEMBL172532 | {[3-(7-Carbamimidoyl-naphthalen-2-ylmethyl)-2-methyl-3H-benzoimidazol-5-yl]-[1-(1-imino-ethyl)-piperidin-4-yl]-amino}-acetic acid methyl ester
TypeSmall organic molecule
Emp. Form.C30H35N7O2
Mol. Mass.525.6446
SMILESCOC(=O)CN(C1CCN(CC1)C(C)=N)c1ccc2nc(C)n(Cc3ccc4ccc(cc4c3)C(N)=N)c2c1