Reaction Details
TargetGlutathione S-transferase A2
LigandBDBM50088968
Substrate/Competitorn/a
Meas. Tech.ChEBML_72327
IC50 90000±n/a nM
Citation Brophy, PMCampbell, AMvan Eldik, AJTeesdale-Spittle, PHLiebau, EWang, MF Beta-carbonyl substituted glutathione conjugates as inhibitors Of O. volvulus GST2. Bioorg Med Chem Lett10:979-81 (2000) Glutathione S-transferase A2
Name:Glutathione S-transferase A2
Type:PROTEIN
Mol. Mass.:25667.17
Organism:Homo sapiens (Human)
Description:ChEMBL_799590
Residue:222
BDBM50088968
NameBDBM50088968
Synonyms:2-Amino-4-[1-(carboxymethyl-carbamoyl)-2-(1-methyl-3-oxo-pentylsulfanyl)-ethylcarbamoyl]-butyric acid | CHEMBL426936
TypeSmall organic molecule
Emp. Form.C16H27N3O7S
Mol. Mass.405.466
SMILESCCC(=O)CC(C)SCC(NC(=O)CCC(N)C(O)=O)C(=O)NCC(O)=O