Reaction Details
TargetIntegrin alpha-4
LigandBDBM50089021
Substrate/Competitorn/a
Meas. Tech.ChEBML_214667
IC50 0.100000±n/a nM
Citation Fotouhi, NJoshi, PTilley, JWRowan, KSchwinge, VWolitzky, B Cyclic thioether peptide mimetics as VCAM-VLA-4 antagonists. Bioorg Med Chem Lett10:1167-9 (2000) Integrin alpha-4
Name:Integrin alpha-4
Type:Membrane Protein
Mol. Mass.:114897.35
Organism:Homo sapiens (Human)
Description:P13612
Residue:1032
BDBM50089021
NameBDBM50089021
Synonyms:(8R,13R)-13-{[1-Acetyl-3-(4-hydroxy-phenyl)-pyrrolidine-2-carbonyl]-amino}-6,14-dioxo-10,11-dithia-7,15-diaza-spiro[4.12]heptadecane-8-carboxylic acid | CHEMBL275603
TypeSmall organic molecule
Emp. Form.C27H36N4O7S2
Mol. Mass.592.727
SMILESCC(=O)N1CCC(C1C(=O)N[C@H]1CSSC[C@H](NC(=O)C2(CCCC2)CCNC1=O)C(O)=O)c1ccc(O)cc1