Reaction Details
TargetChymotrypsinogen A
LigandBDBM50089094
Substrate/Competitorn/a
Meas. Tech.ChEBML_49942
Ki 3100000±n/a nM
Citation Wright, PARostom, AARobinson, CVSchofield, CJ Mass spectrometry reveals elastase inhibitors from the reactive centre loop of alpha1-antitrypsin. Bioorg Med Chem Lett10:1219-21 (2000) Chymotrypsinogen A
Name:Chymotrypsinogen A
Type:Serine protease
Mol. Mass.:25670.88
Organism:Bos taurus (bovine)
Description:n/a
Residue:245
BDBM50089094
NameBDBM50089094
Synonyms:CHEMBL414810 | Met-Phe-Leu-Glu-Ala-Ile-Pro-Met-Ser
TypeSmall organic molecule
Emp. Form.C47H75N9O13S2
Mol. Mass.1038.281
SMILESCC[C@@H](C)[C@@H](NC(=O)[C@@H](C)NC(=O)[C@@H](CCC(O)=O)NC(=O)[C@@H](CC(C)C)NC(=O)[C@@H](Cc1ccccc1)NC(=O)[C@H](N)CCSC)C(=O)N1CCC[C@H]1C(=O)N[C@@H](CCSC)C(=O)N[C@@H](CO)C(O)=O