Reaction Details
TargetMitogen-activated protein kinase 14
LigandBDBM50089131
Substrate/Competitorn/a
Meas. Tech.ChEBML_221156
IC50 450±n/a nM
Citation Revesz, LDi Padova, FEBuhl, TFeifel, RGram, HHiestand, PManning, UZimmerlin, AG SAR of 4-hydroxypiperidine and hydroxyalkyl substituted heterocycles as novel p38 map kinase inhibitors. Bioorg Med Chem Lett10:1261-4 (2000) Mitogen-activated protein kinase 14
Name:Mitogen-activated protein kinase 14
Type:Enzyme
Mol. Mass.:41281.22
Organism:Mus musculus (mouse)
Description:The full-length open reading frame of murine p38 alpha was cloned and expressed in E. coli.. Soluble murine p38R was extracted from cell pellets and purified using ion-exchange chromatography.
Residue:360
BDBM50089131
NameBDBM50089131
Synonyms:4-(2-tert-Butyl-5-phenyl-1H-imidazol-4-yl)-pyridine | CHEMBL278783
TypeSmall organic molecule
Emp. Form.C18H19N3
Mol. Mass.277.3636
SMILESCC(C)(C)c1nc(c([nH]1)-c1ccccc1)-c1ccncc1