Reaction Details
TargetMitogen-activated protein kinase 11
LigandBDBM50089126
Substrate/Competitorn/a
Meas. Tech.ChEBML_221158
IC50 2408±n/a nM
Citation Revesz, LDi Padova, FEBuhl, TFeifel, RGram, HHiestand, PManning, UZimmerlin, AG SAR of 4-hydroxypiperidine and hydroxyalkyl substituted heterocycles as novel p38 map kinase inhibitors. Bioorg Med Chem Lett10:1261-4 (2000) Mitogen-activated protein kinase 11
Name:Mitogen-activated protein kinase 11
Type:Enzyme Catalytic Domain
Mol. Mass.:41351.73
Organism:Homo sapiens (Human)
Description:gi_20128774
Residue:364
BDBM50089126
NameBDBM50089126
Synonyms:4-[4-(4-Fluoro-phenyl)-5-pyridin-4-yl-oxazol-2-yl]-1-methyl-piperidin-4-ol | CHEMBL22978
TypeSmall organic molecule
Emp. Form.C20H20FN3O2
Mol. Mass.353.3901
SMILESCN1CCC(O)(CC1)c1nc(c(o1)-c1ccncc1)-c1ccc(F)cc1