Reaction Details
TargetDelta-type opioid receptor
LigandBDBM50083637
Substrate/Competitorn/a
Meas. Tech.ChEBML_147046
Ki 5.9±n/a nM
Citation Thomas, JBAtkinson, RNRothman, RBBurgess, JPMascarella, SWDersch, CMXu, HCarroll, FI 4-[(8-Alkyl-8-azabicyclo[3.2.1]octyl-3-yl)-3-arylanilino]-N,N-diethylbenzamides: high affinity, selective ligands for the delta opioid receptor illustrate factors important to antagonist activity. Bioorg Med Chem Lett10:1281-4 (2000) Delta-type opioid receptor
Name:Delta-type opioid receptor
Type:G Protein-Coupled Receptor (GPCR)
Mol. Mass.:40465.04
Organism:Rattus norvegicus (rat)
Description:Competition binding assays were using CHO-K1 cell membranes expressing the opioid receptor.
Residue:372
BDBM50083637
NameBDBM50083637
Synonyms:4-(((3S,4R)-1-allyl-3-methylpiperidin-4-yl)(phenyl)amino)-N,N-diethylbenzamide 4-[(1-Allyl-3-methyl-piperidin-4-yl)-phenyl-amino]-N,N-diethyl-benzamide RTI-5989-54
TypeSmall organic molecule
Emp. Form.C26H35N3O
Mol. Mass.405.5756
SMILESCCN(CC)C(=O)c1ccc(cc1)N([C@@H]1CCN(CC=C)C[C@@H]1C)c1ccccc1