Reaction Details
TargetGastrin-releasing peptide receptor
LigandBDBM50089287
Substrate/Competitorn/a
Meas. Tech.ChEMBL_39236 (CHEMBL655732)
Ki>1000000±n/a nM
Comments>0.000010 20220122
Citation Cristau, MDevin, COiry, CChaloin, OAmblard, MBernad, NHeitz, AFehrentz, JAMartinez, J Synthesis and biological evaluation of bombesin constrained analogues. J Med Chem43:2356-61 (2000) Gastrin-releasing peptide receptor
Name:Gastrin-releasing peptide receptor
Type:Enzyme Catalytic Domain
Mol. Mass.:43227.55
Organism:RAT
Description:Gastrin-Releasing peptide 0 RAT::P52500
Residue:384
BDBM50089287
NameBDBM50089287
Synonyms:Bombesin analogues | CHEMBL384242
TypeSmall organic molecule
Emp. Form.C55H70N14O10
Mol. Mass.1087.2321
SMILESCC(C)CC(NC(=O)C(CC(C)C)NC(=O)C(Cc1cnc[nH]1)NC(=O)Cn1c2ccccc2c(=O)n(CCNC(=O)C(Cc2c[nH]c3ccccc23)NC(=O)C(CCC(N)=O)NC(=O)[C@H](N)Cc2ccccc2)c1=O)C(N)=O