Reaction Details
TargetChitin synthase 1
LigandBDBM50089537
Substrate/Competitorn/a
Meas. Tech.ChEBML_49240
IC50 7.2±n/a nM
Citation Masubuchi, KTaniguchi, MUmeda, IHattori, KSuda, HKohchi, YIsshiki, YSakai, TKohchi, MShirai, MOkabe, HSudoh, MYamazaki, TShimma, N Synthesis and structure-activity relationships of novel fungal chitin synthase inhibitors. Bioorg Med Chem Lett10:1459-62 (2000) Chitin synthase 1
Name:Chitin synthase 1
Type:PROTEIN
Mol. Mass.:88249.31
Organism:Candida albicans
Description:ChEMBL_49240
Residue:776
BDBM50089537
NameBDBM50089537
Synonyms:5-{[4-(3,3-Dimethyl-but-1-ynyl)-benzyl]-methyl-amino}-3,4-dihydro-1H-quinolin-2-one | CHEMBL443517
TypeSmall organic molecule
Emp. Form.C23H26N2O
Mol. Mass.346.4653
SMILESCN(Cc1ccc(cc1)C#CC(C)(C)C)c1cccc2NC(=O)CCc12