Reaction Details
TargetChitin synthase 1
LigandBDBM50089539
Substrate/Competitorn/a
Meas. Tech.ChEBML_49240
IC50 12000±n/a nM
Citation Masubuchi, KTaniguchi, MUmeda, IHattori, KSuda, HKohchi, YIsshiki, YSakai, TKohchi, MShirai, MOkabe, HSudoh, MYamazaki, TShimma, N Synthesis and structure-activity relationships of novel fungal chitin synthase inhibitors. Bioorg Med Chem Lett10:1459-62 (2000) Chitin synthase 1
Name:Chitin synthase 1
Type:PROTEIN
Mol. Mass.:88249.31
Organism:Candida albicans
Description:ChEMBL_49240
Residue:776
BDBM50089539
NameBDBM50089539
Synonyms:5-((E)-6,6-Dimethyl-hept-2-en-4-ynylamino)-chromen-2-one | CHEMBL286638
TypeSmall organic molecule
Emp. Form.C18H19NO2
Mol. Mass.281.349
SMILESCC(C)(C)C#C\C=C\CNc1cccc2oc(=O)ccc12