Reaction Details
TargetChitin synthase 1
LigandBDBM50089547
Substrate/Competitorn/a
Meas. Tech.ChEBML_49240
IC50 3±n/a nM
Citation Masubuchi, KTaniguchi, MUmeda, IHattori, KSuda, HKohchi, YIsshiki, YSakai, TKohchi, MShirai, MOkabe, HSudoh, MYamazaki, TShimma, N Synthesis and structure-activity relationships of novel fungal chitin synthase inhibitors. Bioorg Med Chem Lett10:1459-62 (2000) Chitin synthase 1
Name:Chitin synthase 1
Type:PROTEIN
Mol. Mass.:88249.31
Organism:Candida albicans
Description:ChEMBL_49240
Residue:776
BDBM50089547
NameBDBM50089547
Synonyms:5-[(6,6-Dimethyl-hepta-2,4-diynyl)-methyl-amino]-3-hydroxy-3,4-dihydro-1H-quinolin-2-one | CHEMBL287375
TypeSmall organic molecule
Emp. Form.C19H22N2O2
Mol. Mass.310.3902
SMILESCN(CC#CC#CC(C)(C)C)c1cccc2NC(=O)C(O)Cc12